یونان
preferred label: Greece @en
type: Concept
related: رودخانه واردار

رودخانه واردار
scope note: از ماکدونی یوگسلاوی آغاز و به خلیج سالونیکا می ریزد
related: یونان
broader: اروپا
preferred label: Vardar River @en
type: Concept

اروپا
preferred label: Europe @en
type: Concept
narrower: رودخانه واردار