معدن‌کاری روباز
scope note: استخراج سنگ ساختمانی یا دیگر مواد ارزشمند غیرفلزی از یک معدن سطحی روباز
broader: معدن‌کاری
preferred label: quarrying @en
type: Concept

معدن‌کاری
preferred label: mining @en
type: Concept
narrower: معدن‌کاری روباز