آلاسکا
preferred label: Alaska @en
type: Concept
related: سازند بوسر

سازند بوسر
scope note: در گروه تاکسونی، ژوراسیک میانی و بالایی مرکز جنوب آلاسکا
related: آلاسکا
broader: ژوراسیک
preferred label: Bowser Formation @en
type: Concept

ژوراسیک
preferred label: Jurassic @en
type: Concept
narrower: سازند بوسر