گروه بلیرمور
scope note: شامل سازند گلداستون، سازند بیورماینز و سازند میل کریک در جنوب آلبرتا.
related: آلبرتا
broader: کرتاسه
preferred label: Blairmore Group @en
type: Concept

کرتاسه
preferred label: Cretaceous @en
type: Concept
narrower: گروه بلیرمور

آلبرتا
preferred label: Alberta @en
type: Concept
related: گروه بلیرمور