سریسیتی شدن
scope note: نوعی دگرگونی هیپوترمال که منجر به پیدایش کانی سریسیت میشود
related: دگرسانی گرمابی
broader: متاسوماتیزم
preferred label: sericitization @en
type: Concept

دگرسانی گرمابی
preferred label: hydrothermal alteration @en
type: Concept
related: سریسیتی شدن

متاسوماتیزم
preferred label: metasomatism @en
type: Concept
narrower: سریسیتی شدن