ماگمای اولیه
scope note: ماگمایی که از زمان خروج مذاب تا انجماد نهایی ازنظر شیمیایی تعدیل نیافته باشد
broader: ماگما
preferred label: primary magma @en
type: Concept

ماگما
preferred label: magma @en
type: Concept
narrower: ماگمای اولیه