لایه‌بندی
preferred label: bedding @en
type: Concept
related: لایه‌بندی درهم‌پیچیده

لایه‌بندی درهم‌پیچیده
scope note: مجموعه‌لایه‌های بسیار درهم‌ریخته که معمولاً به یک لایۀ خاص رسوب محدود می‌شوند
related: لایه‌بندی
preferred label: convolute bedding @en
type: Concept