لایه راهنما
preferred label: key bed @en
type: Concept
related: لایه نشانه

لایه نشانه
alternative label: کلیدلایه
scope note: قبل از 1978، واژه شامل استفاده برای طبقات کلیدی (چینه نگاری) می گردید.
related: لایه راهنما
related: لرزه‌شناسی
preferred label: marker bed @en
type: Concept

لرزه‌شناسی
preferred label: seismology @en
type: Concept
related: لایه نشانه