گوشته
preferred label: mantle @en
type: Concept
narrower: گوشته نابرجا

گوشته نابرجا
scope note: اجزای سنگی یا خاک حمل‏شده از مکانی به مکان دیگر
broader: گوشته
preferred label: allochtonous mantle @en
type: Concept