گنجایش میدان
scope note: مقدار آبی که پس از خارج شدن آب وزنی اضافی و کاهش محسوس سرعت حرکت عمق آب در خاک باقی می‌ماند.
related: خاک
related: آب زیرزمینی
preferred label: field capacity @en
type: Concept

خاک
preferred label: soil @en
type: Concept
related: گنجایش میدان

آب زیرزمینی
preferred label: ground water @en
type: Concept
related: گنجایش میدان