گسل فلسی
scope note: هریک از مجموعه‌گسل‌های نزدیک و مرتبط‌به‌هم در یک ساختار فلسی
broader: گسل
preferred label: imbricate fault @en
type: Concept

گسل
preferred label: fault @en
type: Concept
narrower: گسل فلسی