ریخت‌شناسی
preferred label: morphology @en
type: Concept
related: گروه‌های آوندی

گروه‌های آوندی
scope note: شامل بخشی از گیاهان با سیستم آوندی شامل پسیلوپسیدا، اسفنوپسیدا، پتروپسیدا و لیکوپسیدا می باشد
related: ریخت‌شناسی
preferred label: vascular taxa @en
type: Concept