زمین‌گاه‌شماری
preferred label: geochronology @en
type: Concept
related: گاه‌شماری لایه‌های خاکستر آتشفشانی

گاه‌شماری لایه‌های خاکستر آتشفشانی
scope note: نوعی تاریخ‌گذاری که بر اساس چینه‌نگاری خاکسترهای آتشفشانی است.
related: سن نسبی
related: زمین‌گاه‌شماری
preferred label: tephrochronology @en
type: Concept

سن نسبی
preferred label: relative age @en
type: Concept
related: گاه‌شماری لایه‌های خاکستر آتشفشانی