کوه رینبو
scope note: قله‌ای در رشته‌کوه سالمون ریور در ناحیه ولی، غرب مرکز ایداهو
related: ناحیه ولی ایداهو
related: منطقه آلاسکا
preferred label: Rainbow Mountain @en
type: Concept

منطقه آلاسکا
preferred label: Alaska range @en
type: Concept
related: کوه رینبو

ناحیه ولی ایداهو
preferred label: Valley County Idaho @en
type: Concept
related: کوه رینبو