کانسار
scope note: توده‏سنگ حاوی کانی‌های باارزش به مقداری که استخراج آن مقرون‌به‌صرفه باشد
narrower: کانسار ماگمایی
narrower: کانسار دورماگمایی
preferred label: ore deposit @en
type: Concept

کانسار ماگمایی
preferred label: magmatic ore deposit @en
type: Concept
broader: کانسار

کانسار دورماگمایی
preferred label: telemagmatic ore deposit @en
type: Concept
broader: کانسار