ناحیه نیپیسینگ اونتاریو
preferred label: Nipissing District Ontario @en
type: Concept
narrower: دهانه برنت

عوارض برخوردی
preferred label: impact features @en
type: Concept
related: دهانه برنت

دهانه برنت
scope note: دهانه شهاب سنگی در برنت در پارک ایالتی آلگونکوتین شرق خلیج جورجین کانادا
related: عوارض برخوردی
broader: ناحیه نیپیسینگ اونتاریو
preferred label: Brent Crater @en
type: Concept