پیناوا مانیتوبا
preferred label: Pinawa Manitoba @en
type: Concept
related: آزمایشگاه پژوهشهای زیرزمینی

مانیتوبا
preferred label: Manitoba @en
type: Concept
narrower: آزمایشگاه پژوهشهای زیرزمینی

آزمایشگاه پژوهشهای زیرزمینی
scope note: در 10 کیلومتری شمال پیناوا مانیتوبا قرار دارد. در ناحیه پژوهشهای وایت شل، غرب انتهای پارک ایالتی وایت شل. محل تحقیقاتی دفن زباله‌های هسته‌ای در باتولیت لاک دوبونت
related: پیناوا مانیتوبا
broader: مانیتوبا
preferred label: Underground Research Laboratory @en
type: Concept