سکوی جنوبگان
scope note: ناحیه مرکزی که تشکیل یک فلات مرتفع را میدهد.
broader: قاره جنوبگان
preferred label: Antarctic Platform @en
type: Concept

قاره جنوبگان
preferred label: Antarctica @en
type: Concept
narrower: سکوی جنوبگان