عوارض برخوردی
preferred label: impact features @en
type: Concept
related: ویلکس لند

ویلکس لند
scope note: ناحیه ساحلی از سپر یخی شاکلتون تا ساحل جورج وی درکناره اقیانوس هند
related: عوارض برخوردی
broader: قاره جنوبگان
preferred label: Wilkes Land @en
type: Concept

قاره جنوبگان
preferred label: Antarctica @en
type: Concept
narrower: ویلکس لند