پرومتیم
scope note: عنصری با عدد اتمی 61، وزن اتمی 145، دمای ذوب 108 درجه(س) و دمای جوش 2450 درجه(س) که از عناصر لانتانیدهاست و نام آن قبلاً ایلینیوم بوده است
broader: خاک کمیاب
preferred label: promethium @en
type: Concept

خاک کمیاب
preferred label: rare earth @en
type: Concept
narrower: پرومتیم