دیسپروزیم
scope note: نوعی عنصر کمیاب خاکی که دارای قدرت مغناطیسی زیادی است.
broader: خاک کمیاب
preferred label: dysprosium @en
type: Concept

خاک کمیاب
preferred label: rare earth @en
type: Concept
narrower: دیسپروزیم