دورسنگ
scope note: واحد گاه‌چینه‌نگاشتی کوچک‌تر از دوره‌سنگ
broader: واحد گاه‌چینه‌نگاشتی
preferred label: series @en
type: Concept

واحد گاه‌چینه‌نگاشتی
preferred label: chronostratigraphic unit @en
type: Concept
narrower: دورسنگ