گوهر
preferred label: gem @en
type: Concept
related: فیروزه کاذب

فیروزه کاذب
scope note: نوعی فیروزه، که محتوی فسفات آهن و آلومینیم است. از قطعات سنگواره استخوان و دندان بوجود آمده است که حدود 6 تا 7 درصد فلوئور کلسیم دارد و رنگ آن کبود متمایل به سبز است
related: گوهر
broader: فسفات‌ها
preferred label: turquoise @en
type: Concept

فسفات‌ها
preferred label: phosphate @en
type: Concept
narrower: فیروزه کاذب