دور
scope note: واحد زمین‌گاه‌شناختی که بزرگ‌تر از عصر و کوچک‌تر از دوره است
broader: واحد زمین‌گاه‌شناختی
preferred label: epoch @en
type: Concept

واحد زمین‌گاه‌شناختی
preferred label: geochronologic unit @en
type: Concept
narrower: دور