فرسایش جانبی
scope note: فرسایشی که در آن دیوارۀ بستر رودخانه با حرکت آب شسته و برده می‌شود
broader: فرسایش
preferred label: lateral erosion @en
type: Concept

فرسایش
preferred label: erosion @en
type: Concept
narrower: فرسایش جانبی