واحد زمین‌گاه‌شناختی
preferred label: geochronologic unit @en
type: Concept
narrower: عصر

عصر
scope note: واحد زمین‌گاه‌شناختی که کوچک‌تر از دور است
broader: واحد زمین‌گاه‌شناختی
preferred label: age(geochronologic unit) @en
type: Concept