تاقدیس
preferred label: anticline @en
type: Concept
related: فراتابیدگی

فراتابیدگی
scope note: تاقدیس وسیع با شیب ملایم که براثر بالاآمدگی‌های تفریقی به‌ وجود آمده است
related: تاقدیس
preferred label: upwarp @en
type: Concept