سازند کهر
preferred label: Kahar Formation @en
type: Concept
related: نئوپروتروزوئیک

نئوپروتروزوئیک
scope note: دوران- فاصله زمانی از 1000 میلیون سال پیش تا قاعده کامبرین- امروزه معادل با پروتروزوئیک فوقانی است که از 900 میلیون سال پیش تا قاعده کامبرین را در بر می گیرد.
related: سازند کهر
preferred label: Neoproterozoic @en
type: Concept