خودریخت
preferred label: idiomorphic @en
type: Concept
related: نیمه‌خودریخت

نیمه‌خودریخت
scope note: ویژگی دانه‌ای که در بخش‌هایی از آن وجوه بلوری دیده می‌شود
related: خودریخت
preferred label: hypidiomorphic @en
type: Concept