مخروط دهانه‌ای
scope note: مخروطی که براثر خروج گدازه از دودکش آتشفشانی در اطراف آن تشکیل می‌شود
broader: عوارض آتشفشانی
preferred label: crater cone @en
type: Concept

عوارض آتشفشانی
preferred label: volcanic features @en
type: Concept
narrower: مخروط دهانه‌ای