نیترات‌زدایی
scope note: احیائ کامل نیتراتها به ازت آزاد و اکسیدهای آزاد
related: زمین‌شیمی
preferred label: denitrification @en
type: Concept

زمین‌شیمی
preferred label: geochemistry @en
type: Concept
related: نیترات‌زدایی