تریلوفوساریا
scope note: شامل خانواده تریلوفوزاریدآ. از 1993. بعنوان یک واژه اخص استفاده می شود
broader: دیاپسیدا
preferred label: Trilophosauria @en
type: Concept

دیاپسیدا
preferred label: Diapsida @en
type: Concept
narrower: تریلوفوساریا