صفحه رنگ خاکه
scope note: قطعه‏ای چینی بدون لعاب که در کانی‏شناسی از آن برای گرفتن رنگ خاکۀ کانی استفاده می‏شود
related: رنگ خاکه
preferred label: streak plate @en
type: Concept

رنگ خاکه
preferred label: streak @en
type: Concept
related: صفحه رنگ خاکه