شیمی چینه‌شناسی
alternative label: شیمی‌چینه‌نگاری
scope note: شاخه‌ای از چینه‌نگاری که در آن از داده‌های شیمی معدنی برای تعیین مشخصات و همبستگی چینه‌ها استفاده می‌شود
related: چینه‌شناسی
related: زمین‌شیمی
preferred label: chemostratigraphy @en
type: Concept

چینه‌شناسی
preferred label: stratigraphy @en
type: Concept
related: شیمی چینه‌شناسی

زمین‌شیمی
preferred label: geochemistry @en
type: Concept
related: شیمی چینه‌شناسی