درزه
preferred label: joint @en
type: Concept
narrower: درزه امتدادی

درزه امتدادی
scope note: درزه‏ای که امتداد آن به موازات لایه‏بندی یا رَخ‏ سنگ است
broader: درزه
preferred label: strike joint @en
type: Concept