درزه
preferred label: joint @en
type: Concept
narrower: درزه برشی

درزه برشی
scope note: درزه‏ای که براثر اعمال نیروی برشی به‌ وجود آمده است
broader: درزه
preferred label: shear joint @en
type: Concept