درزه
preferred label: joint @en
type: Concept
narrower: درزه زمین‏ساختی

درزه زمین‏ساختی
scope note: درزه‏ای که براثر فشارش نیروهای زمین‏ساختی به وجود می‌آید
broader: درزه
preferred label: tectonic joint @en
type: Concept