درزه
preferred label: joint @en
type: Concept
narrower: درزه کُره‏وار

درزه کُره‏وار
scope note: یک دسته ‏شکستگی هم‏مرکز کروی یا بیضوی که پیرامون هسته‏ای متراکم و ریزدانه شکل گرفته باشد
broader: درزه
preferred label: spheroidal joint @en
type: Concept