درزه
preferred label: joint @en
type: Concept
narrower: درزه‏های سامانمند

درزه‏های سامانمند
scope note: درزه‌هایی با ویژگی‌های مشابه که در یک یا چند دسته ظاهر می‌شوند
broader: درزه
preferred label: systematic joints @en
type: Concept