شکست(کانی‌شناسی)
preferred label: fracture(mineralogy) @en
type: Concept
narrower: شکست ناهموار

شکست ناهموار
scope note: شکستی در برخی کانی‌ها یا سنگ‌ها که در آن سطح شکستگی دندانه‏دار و تیز است
broader: شکست(کانی‌شناسی)
preferred label: hackly fracture @en
type: Concept