گروه ملیلیت
preferred label: melilite group @en
type: Concept
narrower: ملیلیت

ملیلیت
scope note: از سوروسیلیکاتهای دارای سیستم مربعی، در سنگهای دگرگونی بوجود می آید. در سنگهای آذرین نیمه اشباع یک سری از تیپ آکرمانیت ها با جانشینی جزئی کلسیم با سدیم و منیزیم بوجود می آید.
broader: گروه ملیلیت
preferred label: melilite @en
type: Concept