گادولینیت
scope note: نام نوعی سیلیکات.ماده معدنی به رنگ سیاه یا قهوه‌ای
broader: سیلیکات جزیره‌ای
preferred label: gadolinite @en
type: Concept

سیلیکات جزیره‌ای
preferred label: nesosilicate @en
type: Concept
narrower: گادولینیت