مونتیسلیت
scope note: از کانیهای گروه اولیوین. از نئوسیلیکاتهای گروه پریدو
broader: گروه اولیوین
preferred label: monticellite @en
type: Concept

گروه اولیوین
preferred label: olivine group @en
type: Concept
narrower: مونتیسلیت