سیستم بلوری
preferred label: crystal system @en
type: Concept
narrower: سیستم چهارگوش

سیستم چهارگوش
alternative label: سیستم چهارگوشه‌ای
scope note: یکی از شش سیستم بلوری که با سه محور عمودبرهم مشخص می‌شود و محور قائم آن دارای چرخش چهارتایه است و دو محور افقی آن طول همسان دارند
related: بلورنگاری
broader: سیستم بلوری
preferred label: tetragonal system @en
type: Concept

بلورنگاری
preferred label: crystallography @en
type: Concept
related: سیستم چهارگوش