سیستم شش‌گوش
preferred label: hexagonal system @en
type: Concept
narrower: سیستم سه‌گوش

سیستم سه‌گوش
alternative label: سیستم سه‌گوشه‌ای
scope note: سیستم بلوری با تقارن سه‌تایه که غالباً بخشی از سیستم شش‌گوش در نظر گرفته می‌شود
related: بلورنگاری
broader: سیستم شش‌گوش
preferred label: trigonal system @en
type: Concept

بلورنگاری
preferred label: crystallography @en
type: Concept
related: سیستم سه‌گوش