سولفیدها
preferred label: sulfide @en
type: Concept
narrower: فوق بازی

فوق بازی
alternative label: دیافوریت
scope note: سنگ آذرین با درصد سیلیس کمتر از 45، غنی از آهن، منیزیم و کلسیم می باشد.
broader: سولفیدها
preferred label: ultrabasite @en
type: Concept