اپسومیت
scope note: سولفات منیزیم که در قشر مارنهای دولومیتی مشاهده می شود.
broader: سولفات‌ها
preferred label: epsomite @en
type: Concept

سولفات‌ها
preferred label: sulfate @en
type: Concept
narrower: اپسومیت