سن‌یابی
preferred label: dating @en
type: Concept
narrower: سن‌یابی اثر شکافت

سن‌یابی اثر شکافت
scope note: روشی برای محاسبۀ سن یا تعیین نسبت چگالی اثرهای شکافت خودبه‌خودی به اثرهای شکافت القاشده
broader: سن‌یابی
preferred label: fission track dating @en
type: Concept