ائوسن میانی
preferred label: middle Eocene @en
type: Concept
narrower: اولاتیزین

اولاتیزین
scope note: آمریکای شمالی. بالای پنوتین، زیر ناریزین
broader: ائوسن میانی
preferred label: Ulatisian @en
type: Concept