جکسونین
scope note: اشکوب آمریکای شمالی، بالای سلایبومیان، زیر ویکسبورجین.
broader: ائوسن
preferred label: Jacksonian @en
type: Concept

ائوسن
preferred label: Eocene @en
type: Concept
narrower: جکسونین